obsolete

mpg123-1.31.1-2.fc36

FEDORA-2022-7568890645 created by kathenas 5 months ago for Fedora 36

Use --disable-largefile and allow co-installable arch devel packages

This update has been submitted for testing by kathenas.

5 months ago

This update's test gating status has been changed to 'waiting'.

5 months ago

This update's test gating status has been changed to 'passed'.

5 months ago
User Icon xvitaly commented & provided feedback 5 months ago
karma

This update breaks ABI:

/usr/bin/ld: /lib/libopenmpt.so.0: undefined reference to mpg123_open_handle_64' /usr/bin/ld: /lib/libopenmpt.so.0: undefined reference tompg123_replace_reader_handle_64' /usr/bin/ld: /lib/libsndfile.so.1: undefined reference to mpg123_seek_64' /usr/bin/ld: /lib/libopenmpt.so.0: undefined reference tompg123_length_64' collect2: error: ld returned 1 exit status

/usr/bin/ld: /lib/libopenmpt.so.0: undefined reference to `mpg123_open_handle_64'
/usr/bin/ld: /lib/libopenmpt.so.0: undefined reference to `mpg123_replace_reader_handle_64'
/usr/bin/ld: /lib/libsndfile.so.1: undefined reference to `mpg123_seek_64'
/usr/bin/ld: /lib/libopenmpt.so.0: undefined reference to `mpg123_length_64'
collect2: error: ld returned 1 exit status 
User Icon gui1ty commented & provided feedback 5 months ago
karma

I encountered similar issues when building brewtarget for i686:

/usr/bin/ld: /lib/libsndfile.so.1: undefined reference to `mpg123_open_handle_64'
/usr/bin/ld: /lib/libsndfile.so.1: undefined reference to `mpg123_replace_reader_handle_64'
/usr/bin/ld: /lib/libsndfile.so.1: undefined reference to `mpg123_seek_64'
/usr/bin/ld: /lib/libsndfile.so.1: undefined reference to `mpg123_length_64'
collect2: error: ld returned 1 exit status
User Icon mtasaka commented & provided feedback 5 months ago
karma

Breaking ABI on stable releases is no-go.

This update has been obsoleted.

5 months ago

Please login to add feedback.

Metadata
Type
bugfix
Karma
-3
Signed
Content Type
RPM
Test Gating
Settings
Unstable by Karma
-3
Stable by Karma
3
Stable by Time
14 days
Dates
submitted
5 months ago

Automated Test Results