Update to latest upstream stable release, Linux v3.17.1. Also fixes a btrfs corruption error when read-only snapshots are used.

How to install

sudo dnf upgrade --refresh --advisory=FEDORA-2014-12955

This update has been submitted for testing by jwboyer.

7 years ago

Taskotron: depcheck test PASSED on i386. Result log: https://taskotron.fedoraproject.org/taskmaster//builders/x86_64/builds/2538/steps/runtask/logs/stdio (results are informative only)

Taskotron: depcheck test PASSED on x86_64. Result log: https://taskotron.fedoraproject.org/taskmaster//builders/x86_64/builds/2538/steps/runtask/logs/stdio (results are informative only)

This update is currently being pushed to the Fedora 21 testing updates repository.

7 years ago

This update has been pushed to testing

7 years ago
User Icon n0oir commented & provided feedback 7 years ago
karma

work fine for me c:

Critical path update approved

7 years ago
User Icon bitlord provided feedback 7 years ago
karma
User Icon raven commented & provided feedback 7 years ago
karma

Works fine.

This update has reached the stable karma threshold and will be pushed to the stable updates repository

7 years ago

Taskotron: upgradepath test PASSED on noarch. Result log: https://taskotron.fedoraproject.org/taskmaster//builders/x86_64/builds/2946/steps/runtask/logs/stdio (results are informative only)

User Icon pnemade provided feedback 7 years ago
karma

Taskotron: upgradepath test FAILED on noarch. Result log: https://taskotron.fedoraproject.org/taskmaster//builders/x86_64/builds/4382/steps/runtask/logs/stdio (results are informative only)

Automatic push to stable based on karma has been disabled for this update due to failure of an AutoQA test. Update submitter, please check the AutoQA test result and see if there is a valid problem to be fixed here, and fix it if so. If the failure is a mistake on AutoQA's part, you can re-enable the automatic push feature for this update if you like, or push it stable manually once it reaches the requirements under the Updates Policy.

7 years ago

Taskotron: upgradepath test FAILED on noarch. Result log: https://taskotron.fedoraproject.org/taskmaster//builders/x86_64/builds/5346/steps/runtask/logs/stdio (results are informative only)

Taskotron: upgradepath test FAILED on noarch. Result log: https://taskotron.fedoraproject.org/taskmaster//builders/x86_64/builds/6335/steps/runtask/logs/stdio (results are informative only)

Taskotron: upgradepath test FAILED on noarch. Result log: https://taskotron.fedoraproject.org/taskmaster//builders/x86_64/builds/7328/steps/runtask/logs/stdio (results are informative only)

This update is currently being pushed to the Fedora 21 stable updates repository.

7 years ago

This update is currently being pushed to the Fedora 21 stable updates repository.

7 years ago

This update has been pushed to stable

7 years ago

Please login to add feedback.

Metadata
Type
security
Karma
4
Signed
Content Type
RPM
Test Gating
Settings
Unstable by Karma
-3
Stable by Karma
disabled
Stable by Time
disabled
Dates
submitted
7 years ago
in testing
7 years ago
in stable
7 years ago
BZ#1045821 ACER Chromebook C720P: touchpad and touchscreen do not work
0
0
BZ#1149509 [PATCH] Apply quirk for elan touchscreens
0
0
BZ#1151095 CVE-2014-7970 Kernel: fs: VFS denial of service
0
0
BZ#1151108 CVE-2014-7975 Kernel: fs: umount denial of service
0
0
BZ#1151484 CVE-2014-7970 Kernel: fs: VFS denial of service [fedora-all]
0
0
BZ#1152025 CVE-2014-7975 Kernel: fs: umount denial of service [fedora-all]
0
0

Automated Test Results

Test Cases

0 0 Test Case kernel regression